{"text_format":"1","workbook":"xlsx","n_sheets":8,"sheets":["Instructions+Data_Dictionary","Floor_Plans","Location_Photographs","Header_Monitor_Master","Monitor_Data_Room_1a","Calculation Details","Compliance Summary","Analysis Support"],"not_rendered":{"charts":0,"images":0,"macros":1,"external_links":0,"defined_names":29,"comments":0,"pivot_tables":0},"unopened":[],"bounds":{"document_bytes":16777216,"sheet_cells":100000,"rows_first":2000,"rows_last":500,"rows_between":2000,"halvings":0,"cell_chars":16384,"cell_head_chars":4096},"cells_cut":0,"cells_raw":0,"read":"whole","date_system":"1900"}

{"sheet":"Instructions+Data_Dictionary","index":0,"n_rows":122,"n_cols":3,"rows_kept":122,"cut":false,"hidden":false,"merged":[[6,1,6,2],[121,0,121,2],[35,1,35,2],[36,1,36,2],[37,1,37,2],[40,0,40,2],[43,1,43,2],[44,1,44,2],[42,1,42,2],[49,1,49,2],[76,0,76,2],[117,2,118,2],[117,0,118,0],[117,1,118,1],[3,0,3,2],[8,0,8,2],[23,0,23,2],[10,0,10,2],[11,1,11,2],[12,0,12,2],[9,1,9,2],[13,1,13,2],[14,1,14,2],[16,1,16,2],[17,1,17,2],[19,1,19,2],[15,0,15,2],[18,0,18,2],[20,1,20,2],[5,0,5,2],[4,0,4,2],[33,0,33,2],[81,1,81,2],[50,1,50,2],[78,1,78,2],[75,0,75,2],[47,0,47,2],[28,1,28,2],[29,1,29,2],[30,1,30,2],[27,1,27,2],[79,1,79,2],[80,1,80,2],[53,0,53,2],[58,0,58,2]]}
[]
["HOW TO USE THIS TOOL"]
["Overview"]
["The Sensor Data Compliance Calculator Template is the submission tool that must be utilized for projects using continuous monitoring technologies to pursue performance-based features with the verification method: Sensor Data (Note: not all features that incorporate continuous monitoring technologies require this tool – refer to the Performance Verification Guidebook document and Support Center article below for details). Its purpose is to 1) provide monitor placement information, sensor and measurement data in a standardized format for streamlined review and 2) calculates feature compliance"]
["Performance Verification Guidebook"]
["Support Center - Understanding the verification method requirements of continuous monitoring pathways"]
["Note: This worksheet required Excel 365. ",{"$f":"IF(ISERROR(_xlfn.LET(_xlpm.x,1,_xlpm.x)), \"Please download the 2024 resource from the Support Center.\", \"Your version is compatible.\")","v":"Your version is compatible."}]
["Process"]
["This tool includes 7 sheets, organized into the 4 categories. The following section provides a general description of the materials and the order in which they should be populated"]
["Sheet Name","Description"]
["1) Instructional and informative | refer to these materials first to understand how the tool works, general instructions and sensor data requirements"]
["Instructions+Data_Dictionary","Provides an overview of this tool and detailed instructions on how to complete data entry fields and calculate compliance"]
["2) Monitor location and placement information | projects teams directly populate these tabs"]
["Floor_Plans","Provides information to confirm sufficient monitor density"]
["Location_Photographs","Provides information to confirm monitor placement requirements"]
["3) Monitor and sensor data | monitoring systems / platforms are expected to generate a consolidated master header and individual monitor data files in the structure defined in the subsequent sections"]
["Header_Monitor_Master","Header file consolidating the location details and static sensor characteristics (e.g., range, calibration date, type) of all continuous monitors for a project"]
["Monitor_Data_DEVICE-ID - COPY","Template sheet for monitor files generated at each location, which includes raw and converted sensor measurements and location occupation states. Duplicate this data sheet for each monitor "]
["4) Compliance calculation | calculates feature compliance with inputted data files"]
["Calculation Details","Provides an overview of performance thresholds and compliance requirements, as well as options to set standard occupancy periods. Additionally, it validates data integrity and formatting of the monitor header and data files"]
["Compliance Summary","An auto-generated report that calculates monitoring data compliance and summarizes feature compliance results once the Analyze button has been invoked in the Calculation Details"]
[]
["INSTRUCTIONS"]
["The subsequent Instructions sections describes how to complete each sheet. Deviating from procedures may result in calculation errors.\n\nFor all fields, utilize consistent naming conventions across sheets (i.e., the Device ID field in Header_Monitor_Master and Location_Photographs sheets and the naming suffix for the Monitor_Data_DEVICE-ID sheet for a specific device utilize the same name)\n\nUnless indicated by an asterick (*), it is necessary to populate all fields and steps\n\nWith the exception of the Monitor_Data_DEVICE-ID - COPY sheet (which is a template file to be duplicated), directly populate the sheets with project information and monitoring data"]
[]
["File Naming"]
["Procedure"]
[1,"Rename this file, utilizing the following format:\nWELL-ID_MMYYYY-MMYYYY_sensor_data_file_compliance_calculator_v2-0"]
[2,"Delete the TEMPLATE_ file prefix "]
[3,"Replace WELL-ID with the project's WELL ID, which can which can be located in WELL Online"]
[4,"Replace MMYYYY-MMYYYY with monitoring period dates"]
["Floor_Plans"]
["General"]
["Duplicate additional Floorplan sections and append to the end of the sheet, as needed"]
["Procedure"]
[1,"For each floor, complete the floor information fields:\n- Floor number\n- Occupiable area of each floor"]
[2,"For each floor, attach a clear floorplan image (JPG/PNG) into the Insert Annotated Floor Plan Here field that meets the following requirements:\n- Are up to date\n- Scaling, dimensions and space types are labeled and legible\n- Includes HVAC, furnishing, and fenestration elements\n- Clearly marked monitor locations"]
["3*","The Notes field can be used for monitor placement clarifications (e.g., justify reduced density for large open areas)"]
["Location_Photographs"]
["General"]
{"$rows_left_out":83}
{"sheet":"Floor_Plans","index":1,"n_rows":92,"n_cols":3,"rows_kept":92,"cut":false,"hidden":false,"merged":[[6,4,6,8],[7,0,32,8],[1,0,1,8],[2,4,2,8],[4,1,4,8],[5,0,5,8],[3,0,3,8],[62,1,62,8],[64,4,64,8],[65,0,90,8],[91,1,91,8],[33,1,33,8],[34,0,34,8],[35,4,35,8],[36,0,61,8],[63,0,63,8]]}
[]
[]
["Floor:",null,"Occupiable Area:"]
["Insert Annotated Floor Plan Here"]
["Notes:"]
[]
["Floor:",null,"Occupiable Area:"]
["Insert Annotated Floor Plan Here"]
[]
[]
[]
[]
[]
[]
[]
[]
[]
[]
[]
[]
[]
[]
[]
[]
[]
[]
[]
[]
[]
[]
[]
[]
[]
["Notes:"]
[]
["Floor:",null,"Occupiable Area:"]
["Insert Annotated Floor Plan Here"]
[]
[]
[]
{"$rows_left_out":53}
{"sheet":"Location_Photographs","index":2,"n_rows":117,"n_cols":3,"rows_kept":117,"cut":false,"hidden":false,"merged":[[31,2,31,8],[1,0,1,8],[2,4,2,8],[3,2,3,8],[4,0,29,8],[30,1,30,8],[88,1,88,8],[89,2,89,8],[90,0,115,8],[116,1,116,8],[32,0,57,8],[58,1,58,8],[59,0,59,8],[60,4,60,8],[61,2,61,8],[62,0,87,8]]}
[]
[]
["Location Number ",null,"Location Name"]
["Device ID"]
["Insert Photograph Here"]
[]
[]
[]
[]
[]
[]
[]
[]
[]
[]
[]
[]
[]
[]
[]
[]
[]
[]
[]
[]
[]
[]
[]
[]
[]
["Notes:"]
["Device ID"]
["Insert Photograph Here"]
[]
[]
[]
[]
[]
[]
[]
{"$rows_left_out":78}
{"sheet":"Header_Monitor_Master","index":3,"n_rows":166,"n_cols":4,"rows_kept":166,"cut":false,"hidden":false,"merged":[]}
["WELL Project ID:"]
["Project Name:",null,{"$f":"_xlfn.SHEET(MonitorNameStart)","v":4}]
["Project Location:"]
["Local Time Zone:"]
["Area of Occupiable Space",null,"m2"]
[]
[null,"Note: the Device-ID must match the ending to the tab names for Monitor_Data_"]
[null,"Monitor 1","Monitor 2","etc"]
["Device-ID","Room_1a"]
["File_name"]
["Device_location_#"]
["Device_location_name"]
["Installation_date"]
["Installation_height"]
["Temp_sensor_type"]
["Temp_range_low"]
["Temp_range_high"]
["Temp_accuracy_specs"]
["Temp_calibration_date"]
["Temp_calibration_validity"]
["Humidity_sensor_type"]
["Humidity_range_low"]
["Humidity_range_high"]
["Humidity_accuracy_specs"]
["Humidity_calibration_date"]
["Humidity_calibration_validity"]
["CO2_sensor_type"]
["CO2_range_low"]
["CO2_range_high"]
["CO2_accuracy_specs"]
["CO2_calibration_date"]
["CO2_calibration_validity"]
["TVOC_sensor_type"]
["TVOC_range_low"]
["TVOC_range_high"]
["TVOC_accuracy_specs"]
["TVOC_calibration_date"]
["TVOC_calibration_validity"]
["TVOC_ppb_ugm3_factor"]
["PM2_5_sensor_type"]
{"$rows_left_out":127}
{"sheet":"Monitor_Data_Room_1a","index":4,"n_rows":3073,"n_cols":27,"rows_kept":3073,"cut":false,"hidden":false,"merged":[]}
["Timestamp","Currently_occupied","Temp_raw","Temp_C","Humidity_raw","Humidity","CO2_raw","CO2_ppm","TVOC_raw","TVOC_ppb","TVOC_ugm3","PM2_5_raw","PM2_5_ugm3","PM10_raw","PM10_ugm3","CO_raw","CO_unit","O3_raw","O3_unit","Rn_raw","Rn_unit","NO2_raw","NO2_unit","Formaldehyde_raw","Formaldehyde_unit","PMV","Temp_unit"]
[null,null,null,null,null,null,null,null,null,null,null,null,null,null,null,null,null,null,null,null,null,null,null,null,null,null,"C"]
[null,null,null,null,null,null,null,null,null,null,null,null,null,null,null,null,null,null,null,null,null,null,null,null,null,null,"C"]
[null,null,null,null,null,null,null,null,null,null,null,null,null,null,null,null,null,null,null,null,null,null,null,null,null,null,"C"]
[null,null,null,null,null,null,null,null,null,null,null,null,null,null,null,null,null,null,null,null,null,null,null,null,null,null,"C"]
[null,null,null,null,null,null,null,null,null,null,null,null,null,null,null,null,null,null,null,null,null,null,null,null,null,null,"C"]
[null,null,null,null,null,null,null,null,null,null,null,null,null,null,null,null,null,null,null,null,null,null,null,null,null,null,"C"]
[null,null,null,null,null,null,null,null,null,null,null,null,null,null,null,null,null,null,null,null,null,null,null,null,null,null,"C"]
[null,null,null,null,null,null,null,null,null,null,null,null,null,null,null,null,null,null,null,null,null,null,null,null,null,null,"C"]
[null,null,null,null,null,null,null,null,null,null,null,null,null,null,null,null,null,null,null,null,null,null,null,null,null,null,"C"]
[null,null,null,null,null,null,null,null,null,null,null,null,null,null,null,null,null,null,null,null,null,null,null,null,null,null,"C"]
[null,null,null,null,null,null,null,null,null,null,null,null,null,null,null,null,null,null,null,null,null,null,null,null,null,null,"C"]
[null,null,null,null,null,null,null,null,null,null,null,null,null,null,null,null,null,null,null,null,null,null,null,null,null,null,"C"]
[null,null,null,null,null,null,null,null,null,null,null,null,null,null,null,null,null,null,null,null,null,null,null,null,null,null,"C"]
[null,null,null,null,null,null,null,null,null,null,null,null,null,null,null,null,null,null,null,null,null,null,null,null,null,null,"C"]
[null,null,null,null,null,null,null,null,null,null,null,null,null,null,null,null,null,null,null,null,null,null,null,null,null,null,"C"]
[null,null,null,null,null,null,null,null,null,null,null,null,null,null,null,null,null,null,null,null,null,null,null,null,null,null,"C"]
[null,null,null,null,null,null,null,null,null,null,null,null,null,null,null,null,null,null,null,null,null,null,null,null,null,null,"C"]
[null,null,null,null,null,null,null,null,null,null,null,null,null,null,null,null,null,null,null,null,null,null,null,null,null,null,"C"]
[null,null,null,null,null,null,null,null,null,null,null,null,null,null,null,null,null,null,null,null,null,null,null,null,null,null,"C"]
[null,null,null,null,null,null,null,null,null,null,null,null,null,null,null,null,null,null,null,null,null,null,null,null,null,null,"C"]
[null,null,null,null,null,null,null,null,null,null,null,null,null,null,null,null,null,null,null,null,null,null,null,null,null,null,"C"]
[null,null,null,null,null,null,null,null,null,null,null,null,null,null,null,null,null,null,null,null,null,null,null,null,null,null,"C"]
[null,null,null,null,null,null,null,null,null,null,null,null,null,null,null,null,null,null,null,null,null,null,null,null,null,null,"C"]
[null,null,null,null,null,null,null,null,null,null,null,null,null,null,null,null,null,null,null,null,null,null,null,null,null,null,"C"]
[null,null,null,null,null,null,null,null,null,null,null,null,null,null,null,null,null,null,null,null,null,null,null,null,null,null,"C"]
[null,null,null,null,null,null,null,null,null,null,null,null,null,null,null,null,null,null,null,null,null,null,null,null,null,null,"C"]
[null,null,null,null,null,null,null,null,null,null,null,null,null,null,null,null,null,null,null,null,null,null,null,null,null,null,"C"]
[null,null,null,null,null,null,null,null,null,null,null,null,null,null,null,null,null,null,null,null,null,null,null,null,null,null,"C"]
[null,null,null,null,null,null,null,null,null,null,null,null,null,null,null,null,null,null,null,null,null,null,null,null,null,null,"C"]
[null,null,null,null,null,null,null,null,null,null,null,null,null,null,null,null,null,null,null,null,null,null,null,null,null,null,"C"]
[null,null,null,null,null,null,null,null,null,null,null,null,null,null,null,null,null,null,null,null,null,null,null,null,null,null,"C"]
[null,null,null,null,null,null,null,null,null,null,null,null,null,null,null,null,null,null,null,null,null,null,null,null,null,null,"C"]
[null,null,null,null,null,null,null,null,null,null,null,null,null,null,null,null,null,null,null,null,null,null,null,null,null,null,"C"]
[null,null,null,null,null,null,null,null,null,null,null,null,null,null,null,null,null,null,null,null,null,null,null,null,null,null,"C"]
[null,null,null,null,null,null,null,null,null,null,null,null,null,null,null,null,null,null,null,null,null,null,null,null,null,null,"C"]
[null,null,null,null,null,null,null,null,null,null,null,null,null,null,null,null,null,null,null,null,null,null,null,null,null,null,"C"]
[null,null,null,null,null,null,null,null,null,null,null,null,null,null,null,null,null,null,null,null,null,null,null,null,null,null,"C"]
[null,null,null,null,null,null,null,null,null,null,null,null,null,null,null,null,null,null,null,null,null,null,null,null,null,null,"C"]
[null,null,null,null,null,null,null,null,null,null,null,null,null,null,null,null,null,null,null,null,null,null,null,null,null,null,"C"]
{"$rows_left_out":3034}
{"sheet":"Calculation Details","index":5,"n_rows":109,"n_cols":5,"rows_kept":109,"cut":false,"hidden":false,"merged":[[9,0,9,7],[8,0,8,7]]}
[]
["CALCULATION DETAILS"]
[]
[]
["Automatic Building Occupancy",null,"(Optional)"]
["Begin occupied time","07:00:00"]
["End occupied time","17:00:00"]
["Occupied on weekends?","No"]
["Note: Time of day and weekend/weekday are only variables considered"]
["You may edit DEVICE-ID-1 occupancy for specific days (e.g., holidays) after you assign automatic occupancy. Occupancy for other monitors is linked to DEVICE-ID-1"]
[]
[]
["Air Parameters"]
["Monitor Numbers",{"$f":"_xlfn.SEQUENCE(1,num_sensors)","v":1}]
["Monitor Names",{"$f":"_xlfn.BYCOL(_xlfn.ANCHORARRAY(B14),_xlfn.LAMBDA(_xlpm.v,OFFSET(MonitorNameStart,0,_xlpm.v)))","v":"Room_1a"}]
[]
["CO2","(Carbon Dioxide)"]
["Column in data sheet",{"$f":"CHAR(64+VLOOKUP(A17,Table1[[Parameter Name]:[Data column]],2,0))","v":"H"},"<--You can overwrite this; must be the same for all monitors"]
["Target threshold 1",900,"ppm"]
["Target threshold 2",750,"ppm"]
["Percent compliance",0.9,"of occupied hours"]
["Monitor Numbers",{"$f":"_xlfn.ANCHORARRAY(B14)","v":1}]
["%age hours meeting target 1",{"$f":"_xlfn.BYCOL(_xlfn.ANCHORARRAY(B$15),_xlfn.LAMBDA(_xlpm.v,COUNTIFS(INDIRECT(\"Monitor_Data_\"&_xlpm.v&\"!B:B\"),\"Y\",INDIRECT(\"Monitor_Data_\"&_xlpm.v&\"!\"&B18&\":\"&B18),\"<=\"&$B19)/\nCOUNTIF(INDIRECT(\"Monitor_Data_\"&_xlpm.v&\"!B:B\"),\"Y\")))","v":{"$error":"#DIV/0!"}}]
["%age hours meeting target 2",{"$f":"_xlfn.BYCOL(_xlfn.ANCHORARRAY(B$15),_xlfn.LAMBDA(_xlpm.v,COUNTIFS(INDIRECT(\"Monitor_Data_\"&_xlpm.v&\"!B:B\"),\"Y\",INDIRECT(\"Monitor_Data_\"&_xlpm.v&\"!\"&B18&\":\"&B18),\"<=\"&$B20)/\nCOUNTIF(INDIRECT(\"Monitor_Data_\"&_xlpm.v&\"!B:B\"),\"Y\")))","v":{"$error":"#DIV/0!"}}]
[]
["TVOC"]
["Column in data sheet",{"$f":"CHAR(64+VLOOKUP(A26,Table1[[Parameter Name]:[Data column]],2,0))","v":"K"}]
["Target threshold",500,"ugm3"]
["Percent compliance",0.9,"of occupied hours"]
["Monitor Numbers",{"$f":"_xlfn.ANCHORARRAY($B$14)","v":1}]
["%age hours meeting target",{"$f":"_xlfn.BYCOL(_xlfn.ANCHORARRAY(B$15),_xlfn.LAMBDA(_xlpm.v,COUNTIFS(INDIRECT(\"Monitor_Data_\"&_xlpm.v&\"!B:B\"),\"Y\",INDIRECT(\"Monitor_Data_\"&_xlpm.v&\"!\"&B27&\":\"&B27),\"<=\"&$B28)/\nCOUNTIF(INDIRECT(\"Monitor_Data_\"&_xlpm.v&\"!B:B\"),\"Y\")))","v":{"$error":"#DIV/0!"}}]
[]
["PM2.5"]
["Column in data sheet",{"$f":"CHAR(64+VLOOKUP(A33,Table1[[Parameter Name]:[Data column]],2,0))","v":"M"}]
["Target threshold 1",15,"ugm3"]
["Target threshold 2",12,"ugm3"]
["Target threshold 3",10,"ugm3"]
["Percent compliance",0.9,"of occupied hours"]
["Monitor Numbers",{"$f":"_xlfn.ANCHORARRAY($B$14)","v":1}]
["%age hours meeting target 1",{"$f":"_xlfn.BYCOL(_xlfn.ANCHORARRAY(B$15),_xlfn.LAMBDA(_xlpm.v,COUNTIFS(INDIRECT(\"Monitor_Data_\"&_xlpm.v&\"!B:B\"),\"Y\",INDIRECT(\"Monitor_Data_\"&_xlpm.v&\"!\"&B34&\":\"&B34),\"<=\"&$B35)/\nCOUNTIF(INDIRECT(\"Monitor_Data_\"&_xlpm.v&\"!B:B\"),\"Y\")))","v":{"$error":"#DIV/0!"}}]
{"$rows_left_out":70}
{"sheet":"Compliance Summary","index":6,"n_rows":97,"n_cols":6,"rows_kept":97,"cut":false,"hidden":false,"merged":[[2,0,2,5],[3,0,3,5]]}
[]
["COMPLIANCE SUMMARY TABLE"]
["NOTE: This sheet calculates Feature compliance automatically, but requires users to enter sensor data and select the Analyze button in the Dashboard sheet. Refer to the Instruction+Data_Dictionary sheet for detailed instructions"]
[{"$f":"IF(SUMPRODUCT(--ISERROR(E16:F97))>0,\"ERROR! Enter Sensor Data and/or check that Device IDs match tab names. The statuses below are not valid.\",\"\")","v":"ERROR! Enter Sensor Data and/or check that Device IDs match tab names. The statuses below are not valid."}]
["Feature","Compliant ?","Feature","Compliant ?"]
["A01.1/PA1: Meet Thresholds for Particulate Matter",{"$f":"IF(AND(B36=\"Yes\",B46=\"Yes\"),\"Yes\",\"No\")","v":"Yes"},"A03.1/PA7: Ensure Adequate Ventilation",{"$f":"B21","v":"Yes"}]
["A05.1/PA2: Meet Enhanced Thresholds for Particulate Matter",{"$f":"IF(AND(B38=\"Yes\",B48=\"Yes\"),\"Tier 2\",IF(AND(B37=\"Yes\",B47=\"Yes\"),\"Tier 1\",\"No\"))","v":"Tier 2"},"A06.1/PA8: Increase Outdoor Air Supply",{"$f":"B22","v":"Yes"}]
["A01.2/PA3: Meet Thresholds for Organic Gases",{"$f":"B28","v":"Yes"},"A01.4/PA9: Meet Thresholds for Radon",{"$f":"B68","v":"Yes"}]
["A01.3/PA5: Meet Thresholds for Inorganic Gases",{"$f":"IF(AND(B56=\"Yes\",B62=\"Yes\"),\"Yes\",\"No\")","v":"Yes"},"T01.1/PT1: Provide Acceptable Thermal Environment",{"$f":"IF(OR(B83=\"Yes\",B97=\"Yes\"),\"Yes\",\"No\")","v":"Yes"}]
["A05.3/PA6: Meet Enhanced Thresholds for Inorganic Gases",{"$f":"IF(AND(B52=\"Yes\",B74=\"Yes\"),\"Yes\",\"No\")","v":"No"},"T07.1/PT2: Manage Relative Humidity",{"$f":"B90","v":"Yes"}]
[]
["Total number of monitors",{"$f":"COUNTA(Header_Monitor_Master!9:9)-1","v":1},"Required monitors",{"$f":"IF(area>0,MAX(ROUNDUP(area/VLOOKUP(area,Table2[[Tier]:[Minimum]],2,1),0),VLOOKUP(area,Table2[[Tier]:[Minimum]],3,1)),\"Enter project area in Header_Monitor_Master\")","v":"Enter project area in Header_Monitor_Master"}]
[]
[]
[{"$f":"'Calculation Details'!A13","v":"Air Parameters"}]
["CO2"]
["Target threshold 1 (PA7)",{"$f":"'Calculation Details'!B19","v":900},{"$f":"'Calculation Details'!C19","v":"ppm"}]
["Target threshold 2 (PA8)",{"$f":"'Calculation Details'!B20","v":750},{"$f":"'Calculation Details'!C20","v":"ppm"}]
["Percent compliance",{"$f":"'Calculation Details'!B21","v":0.9},{"$f":"'Calculation Details'!C21","v":"of occupied hours"}]
["Monitor Statistics","Compliant w/ Target ?",{"$f":"\"# Monitors Compliant ≥ \"&B19*100&\"%\"","v":"# Monitors Compliant ≥ 90%"},{"$f":"\"# Monitors Not Compliant ≥ \"&B19*100&\"%\"","v":"# Monitors Not Compliant ≥ 90%"},"Mean Hours Compliant","Median Hours Compliant"]
["Target 1 (PA7)",{"$f":"IF(D21=0,\"Yes\",\"No\")","v":"Yes"},{"$f":"COUNTIF('Calculation Details'!23:23,\">=\"&B19)","v":0},{"$f":"COUNTIF('Calculation Details'!23:23,\"<\"&B19)","v":0},{"$f":"AVERAGE('Calculation Details'!23:23)","v":{"$error":"#DIV/0!"}},{"$f":"MEDIAN('Calculation Details'!23:23)","v":{"$error":"#DIV/0!"}}]
["Target 2 (PA8)",{"$f":"IF(D22=0,\"Yes\",\"No\")","v":"Yes"},{"$f":"COUNTIF('Calculation Details'!24:24,\">=\"&$B19)","v":0},{"$f":"COUNTIF('Calculation Details'!24:24,\"<\"&B19)","v":0},{"$f":"AVERAGE('Calculation Details'!24:24)","v":{"$error":"#DIV/0!"}},{"$f":"MEDIAN('Calculation Details'!24:24)","v":{"$error":"#DIV/0!"}}]
[]
["TVOC"]
["Target threshold (PA3)",{"$f":"'Calculation Details'!B28","v":500},{"$f":"'Calculation Details'!C28","v":"ugm3"}]
["Percent compliance",{"$f":"'Calculation Details'!B29","v":0.9},{"$f":"'Calculation Details'!C29","v":"of occupied hours"}]
["Monitor Statistics","Compliant w/ Target ?",{"$f":"\"# Monitors Compliant ≥ \"&B26*100&\"%\"","v":"# Monitors Compliant ≥ 90%"},{"$f":"\"# Monitors Not Compliant ≥ \"&B26*100&\"%\"","v":"# Monitors Not Compliant ≥ 90%"},"Mean Hours Compliant","Median Hours Compliant"]
["Target 1 (PA3)",{"$f":"IF(D28=0,\"Yes\",\"No\")","v":"Yes"},{"$f":"COUNTIF('Calculation Details'!31:31,\">=\"&B26)","v":0},{"$f":"COUNTIF('Calculation Details'!31:31,\"<\"&B26)","v":0},{"$f":"AVERAGE('Calculation Details'!31:31)","v":{"$error":"#DIV/0!"}},{"$f":"MEDIAN('Calculation Details'!31:31)","v":{"$error":"#DIV/0!"}}]
[]
["PM2.5"]
["Target threshold 1 (PA1)",{"$f":"'Calculation Details'!B35","v":15},{"$f":"'Calculation Details'!C35","v":"ugm3"}]
["Target threshold 2 (PA2)",{"$f":"'Calculation Details'!B36","v":12},{"$f":"'Calculation Details'!C36","v":"ugm3"}]
["Target threshold 3 (PA2)",{"$f":"'Calculation Details'!B37","v":10},{"$f":"'Calculation Details'!C37","v":"ugm3"}]
["Percent compliance",{"$f":"'Calculation Details'!B38","v":0.9},{"$f":"'Calculation Details'!C38","v":"of occupied hours"}]
["Monitor Statistics","Compliant w/ Target ?",{"$f":"\"# Monitors Compliant ≥ \"&B34*100&\"%\"","v":"# Monitors Compliant ≥ 90%"},{"$f":"\"# Monitors Not Compliant ≥ \"&B34*100&\"%\"","v":"# Monitors Not Compliant ≥ 90%"},"Mean Hours Compliant","Median Hours Compliant"]
["Target 1 (PA1)",{"$f":"IF(D36=0,\"Yes\",\"No\")","v":"Yes"},{"$f":"COUNTIF('Calculation Details'!40:40,\">=\"&B34)","v":0},{"$f":"COUNTIF('Calculation Details'!40:40,\"<\"&B34)","v":0},{"$f":"AVERAGE('Calculation Details'!40:40)","v":{"$error":"#DIV/0!"}},{"$f":"MEDIAN('Calculation Details'!40:40)","v":{"$error":"#DIV/0!"}}]
["Target 2 (PA2)",{"$f":"IF(D37=0,\"Yes\",\"No\")","v":"Yes"},{"$f":"COUNTIF('Calculation Details'!41:41,\">=\"&$B34)","v":0},{"$f":"COUNTIF('Calculation Details'!41:41,\"<\"&B34)","v":0},{"$f":"AVERAGE('Calculation Details'!41:41)","v":{"$error":"#DIV/0!"}},{"$f":"MEDIAN('Calculation Details'!41:41)","v":{"$error":"#DIV/0!"}}]
["Target 3 (PA2)","Yes",{"$f":"COUNTIF('Calculation Details'!42:42,\">=\"&$B34)","v":0},{"$f":"COUNTIF('Calculation Details'!42:42,\"<\"&B34)","v":0},{"$f":"AVERAGE('Calculation Details'!42:42)","v":{"$error":"#DIV/0!"}},{"$f":"MEDIAN('Calculation Details'!42:42)","v":{"$error":"#DIV/0!"}}]
[]
["PM10"]
{"$rows_left_out":58}
{"sheet":"Analysis Support","index":7,"n_rows":48,"n_cols":9,"rows_kept":48,"cut":false,"hidden":true,"merged":[]}
[]
["Parameter Order","Parameter Name","Data column","Number of Tiers","Parameter Start","Lower Threshold?"]
[1,"CO2",8,2,{"$f":"ROW(INDIRECT(Table1[[#This Row],[Parameter Name]]&\"_start\"))","v":17}]
[2,"TVOC",11,1,{"$f":"ROW(INDIRECT(Table1[[#This Row],[Parameter Name]]&\"_start\"))","v":26}]
[3,"PM2.5",13,3,{"$f":"ROW(INDIRECT(Table1[[#This Row],[Parameter Name]]&\"_start\"))","v":33},null,null,null,"First Monitor sheet name"]
[4,"PM10",15,3,{"$f":"ROW(INDIRECT(Table1[[#This Row],[Parameter Name]]&\"_start\"))","v":44},null,null,null,{"$f":"\"Monitor_Data_\"&Header_Monitor_Master!B9","v":"Monitor_Data_Room_1a"}]
[5,"CO",17,2,{"$f":"ROW(INDIRECT(Table1[[#This Row],[Parameter Name]]&\"_start\"))","v":55}]
[6,"O3",19,1,{"$f":"ROW(INDIRECT(Table1[[#This Row],[Parameter Name]]&\"_start\"))","v":64}]
[7,"Rn",21,1,{"$f":"ROW(INDIRECT(Table1[[#This Row],[Parameter Name]]&\"_start\"))","v":71}]
[8,"NO2",23,1,{"$f":"ROW(INDIRECT(Table1[[#This Row],[Parameter Name]]&\"_start\"))","v":78}]
[9,"Temperature",4,1,{"$f":"ROW(INDIRECT(Table1[[#This Row],[Parameter Name]]&\"_start\"))","v":87},"Yes"]
[10,"Humidity",6,1,{"$f":"ROW(INDIRECT(Table1[[#This Row],[Parameter Name]]&\"_start\"))","v":95},"Yes"]
[11,"PMV",26,1,{"$f":"ROW(INDIRECT(Table1[[#This Row],[Parameter Name]]&\"_start\"))","v":103},"Yes"]
[]
[]
["Thresholds in multiple units"]
["Parameter","ugm3","ppb","mgm3","ppm","bql","pcil","F","C"]
["CO 1",null,null,10,9]
["CO 2",null,null,7,6]
["O3 1",100,51]
["Rn 1",null,null,null,null,0.15,4]
["NO2 1",40,21]
["Temperature +",null,null,null,null,null,null,77,25]
["Temperature -",null,null,null,null,null,null,70,21]
[]
[]
["Monitor quantities"]
["Tier[metric]","density[metric]","Tier[IP]","Density[IP]","Tier","Density","Minimum"]
[0,325,0,3500,{"$f":"IF(units=\"m2\",A29,C29)","v":0},325,2]
[3250,500,35000,5400,3250,500,10]
[25000,1000,269100,10800,25000,1000,50]
[]
[]
[]
["How do complicated formula work?"]
[]
["Compliance calculation"]
["=BYCOL(B$17#,LAMBDA(v,\n"]
["\"byCol\" says \"do the following formula for every cell in an array. "]
["B17# is the list of all the monitor sheet names, which itself is generated by an array formula. The \"#\" means to look at the entire array. "]
{"$rows_left_out":8}