{"text_format":"1","workbook":"xlsx","n_sheets":4,"sheets":["Encodage","PressionRef","Calcul","Matériaux"],"not_rendered":{"charts":0,"images":3,"macros":1,"external_links":0,"defined_names":0,"comments":0,"pivot_tables":0},"unopened":[],"bounds":{"document_bytes":16777216,"sheet_cells":100000,"rows_first":2000,"rows_last":500,"rows_between":2000,"halvings":0,"cell_chars":16384,"cell_head_chars":4096},"cells_cut":0,"cells_raw":0,"read":"whole","date_system":"1900"}

{"sheet":"Encodage","index":0,"n_rows":4,"n_cols":17,"rows_kept":4,"cut":false,"hidden":false,"merged":[]}
[null,null,null,null,null,null,null,"H",{"$f":"IF(H2=1,\"- gas\",\"- gaz\")","v":"- gaz"},null,"Tuyau le plus économi-que"]
["ID",{"$f":"IF(H2=1,\"Omschrijving\",\"Description\")","v":"Description"},{"$f":"IF(H2=1,\"Leiding-deel\",\"Tronçon\")","v":"Tronçon"},{"$f":"IF(H2=1,\"Materiaal\",\"Matériau\")","v":"Matériau"},{"$f":"IF(H2=1,\"Afstand\",\"Distance\")","v":"Distance"},{"$f":"IF(H2=1,\"Verloop\",\"Direction\")","v":"Direction"},{"$f":"IF(H2=1,\"Verbruik\",\"Débit\")","v":"Débit"},2,"DN",null,{"$f":"IF(H2=1,\"Drukverlies t.a. Toestel\",\"Perte de pression jusqu' à           l' appareil\")","v":"Perte de pression jusqu' à           l' appareil"},{"$f":"IF(H2=1,\"Overgang\",\"Transition\")","v":"Transition"},{"$f":"IF(H2=1,\"Splitsing\",\"Bifurcation\")","v":"Bifurcation"},{"$f":"IF(H2=1,\"Toestel\",\"Appareil\")","v":"Appareil"}]
["A",{"$f":"IF(H2=1,\"Teller\",\"Compteur\")","v":"Compteur"},{"$f":"IF(H2=1,\"Leiding zo Goedkoop Mogelijk\",\"Tuyau le plus économi-que\")","v":"Tuyau le plus économi-que"},{"$f":"IF(H2=1,\"DN één of meerdere leidingen bestaand\",\"DN un ou plusieurs tuyaux existant\")","v":"DN un ou plusieurs tuyaux existant"},{"$f":"IF(H2=1,\"Fe Schroef\",\"Fe filetable\")","v":"Fe filetable"},{"$f":"IF(H2=1,\"Fe Las\",\"Fe à souder\")","v":"Fe à souder"},{"$f":"IF(H2=1,\"RVS Schroef\",\"INOX filetable\")","v":"INOX filetable"},{"$f":"IF(H2=1,\"RVS Las\",\"INOX à souder\")","v":"INOX à souder"},{"$f":"IF(H2=1,\"RVS Pers / Knel\", \"INOX Serti / Compr\")","v":"INOX Serti / Compr"},"Cu","PE",{"$f":"IF(H2=1,\"Boven\",\"Haut\")","v":"Haut"},{"$f":"IF(H2=1,\"Achter\",\"Arrière\")","v":"Arrière"},{"$f":"IF(H2=1,\"Rechts\",\"Droite\")","v":"Droite"},{"$f":"IF(H2=1,\"Onder\",\"Bas\")","v":"Bas"},{"$f":"IF(H2=1,\"Voor\",\"Avant\")","v":"Avant"},{"$f":"IF(H2=1,\"Links\",\"Gauche\")","v":"Gauche"}]
["B"]

{"sheet":"PressionRef","index":1,"n_rows":1,"n_cols":27,"rows_kept":1,"cut":false,"hidden":false,"merged":[]}
[{"$f":"IF(Encodage!H2=1,\"Toestel Leiding\",\"Appareil Tuyau\")","v":"Appareil Tuyau"},"Δh",{"$f":"IF(Encodage!H2=1,\"Δh x gas\",\"Δh x gaz\")","v":"Δh x gaz"},"Δp max","L","L fict.",{"$f":"IF(Encodage!H2=1,\"Druk verlies\",\"Perte de pression\")","v":"Perte de pression"},null,null,null,null,null,null,null,null,null,null,null,null,null,null,null,null,null,null,null,"TWXT - FGDD - @@MR - LHHV"]

{"sheet":"Calcul","index":2,"n_rows":1,"n_cols":10,"rows_kept":1,"cut":false,"hidden":false,"merged":[]}
[{"$f":"IF(Encodage!H2=1,\"Leiding Deel\",\"Tronçon\")","v":"Tronçon"},{"$f":"IF(Encodage!H2=1,\"Gas Debiet\",\"Débit Gaz\")","v":"Débit Gaz"},"DN","Diameter","Δp / m","L","L fict.","Δh",{"$f":"IF(Encodage!H2=1,\"Δh x gas\",\"Δh x gaz\")","v":"Δh x gaz"},{"$f":"IF(Encodage!H2=1,\"Druk verlies\",\"Perte de pression\")","v":"Perte de pression"}]

{"sheet":"Matériaux","index":3,"n_rows":25,"n_cols":37,"rows_kept":25,"cut":false,"hidden":false,"merged":[[0,27,0,31],[0,32,0,36],[0,0,0,5],[0,7,0,11],[0,12,0,15],[0,17,0,20],[0,22,0,26]]}
[{"$f":"IF(Encodage!H2=1,\"Fe Schroef\",\"Fe filetable\")","v":"Fe filetable"},null,null,null,null,null,null,{"$f":"IF(Encodage!H2=1,\"Fe Las\",\"Fe à souder\")","v":"Fe à souder"},null,null,null,null,{"$f":"IF(Encodage!H2=1,\"RVS Schroef\",\"INOX filetable\")","v":"INOX filetable"},null,null,null,null,{"$f":"IF(Encodage!H2=1,\"RVS Las\",\"INOX à souder\")","v":"INOX à souder"},null,null,null,null,{"$f":"IF(Encodage!H2=1,\"RVS Pers / Knel\", \"INOX Serti / Compr\")","v":"INOX Serti / Compr"},null,null,null,null,"Cu",null,null,null,null,"PE"]
["Naadloze buizen volgens EN 10255 H (DIN 2441)",null,null,null,null,null,null,"Naadloze buizen volgens EN 10216-2",null,null,null,null,null,null,null,null,null,null,null,null,null,null,"Naadloze buis volgens EN 10216-5 TC1",null,null,null,null,"Buizen volgens NBN EN 1057"]
["DN",{"$f":"IF(Encodage!$H$2=1,\"Buiten Ø mm\",\"Ø Extérieur mm\")","v":"Ø Extérieur mm"},{"$f":"IF(Encodage!$H$2=1,\"Wand dikte\",\"Paroi mm\")","v":"Paroi mm"},{"$f":"IF(Encodage!$H$2=1,\"Binnen Ø mm\",\"Ø Intérieur mm\")","v":"Ø Intérieur mm"},null,"Inch",null,"DN",{"$f":"IF(Encodage!$H$2=1,\"Buiten Ø mm\",\"Ø Extérieur mm\")","v":"Ø Extérieur mm"},{"$f":"IF(Encodage!$H$2=1,\"Wand dikte\",\"Paroi mm\")","v":"Paroi mm"},{"$f":"IF(Encodage!$H$2=1,\"Binnen Ø mm\",\"Ø Intérieur mm\")","v":"Ø Intérieur mm"},null,"DN",{"$f":"IF(Encodage!$H$2=1,\"Buiten Ø mm\",\"Ø Extérieur mm\")","v":"Ø Extérieur mm"},{"$f":"IF(Encodage!$H$2=1,\"Wand dikte\",\"Paroi mm\")","v":"Paroi mm"},{"$f":"IF(Encodage!$H$2=1,\"Binnen Ø mm\",\"Ø Intérieur mm\")","v":"Ø Intérieur mm"},null,"DN",{"$f":"IF(Encodage!$H$2=1,\"Buiten Ø mm\",\"Ø Extérieur mm\")","v":"Ø Extérieur mm"},{"$f":"IF(Encodage!$H$2=1,\"Wand dikte\",\"Paroi mm\")","v":"Paroi mm"},{"$f":"IF(Encodage!$H$2=1,\"Binnen Ø mm\",\"Ø Intérieur mm\")","v":"Ø Intérieur mm"},null,"DN",{"$f":"IF(Encodage!$H$2=1,\"Buiten Ø mm\",\"Ø Extérieur mm\")","v":"Ø Extérieur mm"},{"$f":"IF(Encodage!$H$2=1,\"Wand dikte\",\"Paroi mm\")","v":"Paroi mm"},{"$f":"IF(Encodage!$H$2=1,\"Binnen Ø mm\",\"Ø Intérieur mm\")","v":"Ø Intérieur mm"},null,"DN",{"$f":"IF(Encodage!$H$2=1,\"Buiten Ø mm\",\"Ø Extérieur mm\")","v":"Ø Extérieur mm"},{"$f":"IF(Encodage!$H$2=1,\"Wand dikte\",\"Paroi mm\")","v":"Paroi mm"},{"$f":"IF(Encodage!$H$2=1,\"Binnen Ø mm\",\"Ø Intérieur mm\")","v":"Ø Intérieur mm"},null,"DN",{"$f":"IF(Encodage!$H$2=1,\"Buiten Ø mm\",\"Ø Extérieur mm\")","v":"Ø Extérieur mm"},{"$f":"IF(Encodage!$H$2=1,\"Wand dikte\",\"Paroi mm\")","v":"Paroi mm"},{"$f":"IF(Encodage!$H$2=1,\"Binnen Ø mm\",\"Ø Intérieur mm\")","v":"Ø Intérieur mm"}]
[15,21.3,3.25,{"$f":"B4-2*C4","v":14.8},3.25,"1/2\"",null,15,21.3,2.6,{"$f":"I4-2*J4","v":16.100000000000001},2.6,15,21.3,2.6,{"$f":"N4-2*O4","v":16.100000000000001},2.6,15,21.3,2.6,{"$f":"S4-2*T4","v":16.100000000000001},2.6,15,15,1,{"$f":"X4-2*Y4","v":13},1,12,12,1,{"$f":"AC4-2*AD4","v":10},1,32,32,3,{"$f":"AH4-2*AI4","v":26},3]
[20,26.9,3.25,20.399999999999999,3.25,"3/4\"",null,20,26.9,2.6,21.7,2.6,20,26.9,2.6,21.7,2.6,20,26.9,2.6,21.7,2.6,18,18,1,16,1,15,15,1,13,1,40,40,3.7,32.6,3.7]
[25,33.700000000000003,4.05,25.6,4.05,"1\"",null,25,33.700000000000003,2.6,28.500000000000004,2.6,25,33.700000000000003,3.2,27.300000000000004,3.2,25,33.700000000000003,2.6,28.500000000000004,2.6,20,22,1.2,19.600000000000001,1.2,18,18,1,16,1,50,50,4.5999999999999996,40.799999999999997,4.5999999999999996]
[32,42.4,4.05,34.299999999999997,4.05,"1¼\"",null,32,42.2,2.6,37,2.6,32,42.4,3.2,36,3.2,32,42.4,2.6,37.199999999999996,2.6,25,28,1.2,25.6,1.2,20,22,1,20,1,63,63,5.8,51.4,5.8]
[40,48.3,4.05,40.199999999999996,4.05,"1½\"",null,40,48.3,2.6,43.099999999999994,2.6,40,48.3,3.2,41.9,3.2,40,48.3,2.6,43.099999999999994,2.6,32,35,1.5,32,1.5,25,28,1,26,1,75,75,6.8,61.4,6.8]
[50,60.3,4.5,51.3,4.5,"2\"",null,50,60.3,2.9,54.5,2.9,50,60.3,3.6,53.099999999999994,3.6,50,60.3,2.9,54.5,2.9,40,42,1.5,39,1.5,32,35,1.2,32.6,1.2,90,90,8.1999999999999993,73.599999999999994,8.1999999999999993]
[null,null,null,null,null,"2½\"",null,65,76.099999999999994,2.9,70.3,2.9,null,null,null,null,null,65,76.099999999999994,2.9,70.3,2.9,50,54,1.5,51,1.5,40,42,1.2,39.6,1.2,110,110,6.6,96.8,6.6]
[null,null,null,null,null,"3\"",null,80,88.9,3.2,82.5,3.2,null,null,null,null,null,80,88.9,3.2,82.5,3.2,null,null,null,null,null,50,54,1.5,51,1.5,125,125,7.4,110.2,7.4]
[null,null,null,null,null,"4\"",null,100,114.3,3.6,107.1,3.6,null,null,null,null,null,100,114.3,3.2,107.89999999999999,3.2,null,null,null,null,null,null,null,null,null,null,140,140,8.3000000000000007,123.4,8.3000000000000007]
[null,null,null,null,null,"5\"",null,125,139.69999999999999,4,131.69999999999999,4,null,null,null,null,null,125,139.69999999999999,3.6,132.5,3.6,null,null,null,null,null,null,null,null,null,null,160,160,9.5,141,9.5]
[null,null,null,null,null,"6\"",null,150,168.3,4.5,159.30000000000001,4.5,null,null,null,null,null,150,168.3,4,160.30000000000001,4,null,null,null,null,null,null,null,null,null,null,180,180,10.7,158.6,10.7]
[null,null,null,null,null,"8\"",null,200,219.1,5.9,207.29999999999998,5.9,null,null,null,null,null,200,219.1,4.5,210.1,4.5,null,null,null,null,null,null,null,null,null,null,200,200,11.9,176.2,11.9]
[null,null,null,null,null,"10\"",null,250,273,6.3,260.39999999999998,6.3,null,null,null,null,null,250,273,5,263,5,null,null,null,null,null,null,null,null,null,null,225,225,13.4,198.2,13.4]
[null,null,null,null,null,"12''",null,300,323.89999999999998,7.1,309.7,7.1,null,null,null,null,null,300,323.89999999999998,5.6,312.7,5.6,null,null,null,null,null,null,null,null,null,null,250,250,14.8,220.4,14.8]
[null,null,null,null,null,null,null,null,null,null,null,null,null,null,null,null,null,null,null,null,null,null,null,null,null,null,null,null,null,null,null,null,280,280,16.600000000000001,246.8,16.600000000000001]
[null,null,null,null,null,null,null,null,null,null,null,null,null,null,null,null,null,null,null,null,null,null,null,null,null,null,null,null,null,null,null,null,315,315,18.7,277.60000000000002,18.7]
[null,null,null,null,null,null,null,null,null,null,null,null,null,null,null,null,null,null,null,null,null,null,null,null,null,null,null,null,null,null,null,null,355,355,21.1,312.8,21.1]
[null,null,null,null,null,null,null,null,null,null,null,null,null,null,null,null,null,null,null,null,null,null,null,null,null,null,null,null,null,null,null,null,400,400,23.7,352.6,23.7]
[null,null,null,null,null,null,null,null,null,null,null,null,null,null,null,null,null,null,null,null,null,null,null,null,null,null,null,null,null,null,null,null,450,450,26.7,396.6,26.7]
[null,null,null,null,null,null,null,null,null,null,null,null,null,null,null,null,null,null,null,null,null,null,null,null,null,null,null,null,null,null,null,null,500,500,29.7,440.6,29.7]
[null,null,null,null,null,null,null,null,null,null,null,null,null,null,null,null,null,null,null,null,null,null,null,null,null,null,null,null,null,null,null,null,560,560,33.200000000000003,493.6,33.200000000000003]
[null,null,null,null,null,null,null,null,null,null,null,null,null,null,null,null,null,null,null,null,null,null,null,null,null,null,null,null,null,null,null,null,630,630,37.4,555.20000000000005,37.4]